Reaction Details
TargetNeurotensin receptor type 1
LigandBDBM50048908
Substrate/Competitorn/a
Meas. Tech.ChEBML_1629220
Ki 0.240000±n/a nM
Citation Simeth, NABause, MDobmeier, MKling, RCLachmann, DHübner, HEinsiedel, JGmeiner, PKönig, B NTS2-selective neurotensin mimetics with tetrahydrofuran amino acids. Bioorg Med Chem25:350-359 (2017) 
 
Neurotensin receptor type 1
Name:Neurotensin receptor type 1
Type:PROTEIN
Mol. Mass.:46278.89
Organism:Homo sapiens (Human)
Description:ChEMBL_1453811
Residue:418
BDBM50048908
NameBDBM50048908
Synonyms:CHEMBL415788
TypeSmall organic molecule
Emp. Form.C38H64N12O8
Mol. Mass.816.9904
SMILESCC[C@H](C)[C@H](NC(=O)[C@H](Cc1ccc(O)cc1)NC(=O)[C@@H]1CCCN1C(=O)[C@H](CCCNC(N)=N)NC(=O)[C@@H](N)CCCNC(N)=N)C(=O)N[C@@H](CC(C)C)C(O)=O