Reaction Details
Target5-hydroxytryptamine receptor 2A
LigandBDBM50206725
Substrate/Competitorn/a
Meas. Tech.ChEBML_1629229
Ki 6.3±n/a nM
Citation Schrader, TOKasem, MRen, AFeichtinger, KAl Doori, BWei, JWu, CDang, HLe, MGatlin, JChase, KDong, JWhelan, KTSage, CGrottick, AJSemple, G Tetrahydroquinoline-based tricyclic amines as potent and selective agonists of the 5-HT Bioorg Med Chem Lett26:5877-5882 (2016) 
 
5-hydroxytryptamine receptor 2A
Name:5-hydroxytryptamine receptor 2A
Type:undefined
Mol. Mass.:52607.65
Organism:Homo sapiens (Human)
Description:P28223
Residue:471
BDBM50206725
NameBDBM50206725
Synonyms:CHEMBL3947276
TypeSmall organic molecule
Emp. Form.C15H22N2
Mol. Mass.230.3486
SMILESCCCc1cccc2N3CCNCC3CCc12