Reaction Details
Target5-hydroxytryptamine receptor 1A
LigandBDBM50206760
Substrate/Competitorn/a
Meas. Tech.ChEMBL_1629238 (CHEMBL3871864)
Ki 6.0±n/a nM
Citation Yoshinaga, HMasumoto, SKoyama, KKinomura, NMatsumoto, YKato, TBaba, SMatsumoto, KHorisawa, TOki, HYabuuchi, KKodo, T Discovery of SMP-304, a novel benzylpiperidine derivative with serotonin transporter inhibitory activity and 5-HT Bioorg Med Chem25:293-304 (2017) 
 
5-hydroxytryptamine receptor 1A
Name:5-hydroxytryptamine receptor 1A
Type:n/a
Mol. Mass.:46122.49
Organism:Homo sapiens (Human)
Description:n/a
Residue:422
BDBM50206760
NameBDBM50206760
Synonyms:CHEMBL3892582
TypeSmall organic molecule
Emp. Form.C21H26FNO
Mol. Mass.327.4356
SMILESCOc1ccc(F)c(CC2CCN(CCc3ccccc3)CC2)c1