Reaction Details
Target5-hydroxytryptamine receptor 1A
LigandBDBM50206758
Substrate/Competitorn/a
Meas. Tech.ChEMBL_1629238 (CHEMBL3871864)
Ki 16±n/a nM
Citation Yoshinaga, HMasumoto, SKoyama, KKinomura, NMatsumoto, YKato, TBaba, SMatsumoto, KHorisawa, TOki, HYabuuchi, KKodo, T Discovery of SMP-304, a novel benzylpiperidine derivative with serotonin transporter inhibitory activity and 5-HT Bioorg Med Chem25:293-304 (2017) 
 
5-hydroxytryptamine receptor 1A
Name:5-hydroxytryptamine receptor 1A
Type:n/a
Mol. Mass.:46122.49
Organism:Homo sapiens (Human)
Description:n/a
Residue:422
BDBM50206758
NameBDBM50206758
Synonyms:CHEMBL3898537
TypeSmall organic molecule
Emp. Form.C25H31BrClNO3
Mol. Mass.508.876
SMILESCC(C)Oc1ccc(Br)c(CC2CCN(CCc3cc4OCCOc4cc3Cl)CC2)c1