Reaction Details
TargetSodium-dependent serotonin transporter
LigandBDBM50206797
Substrate/Competitorn/a
Meas. Tech.ChEMBL_1629237 (CHEMBL3871863)
Ki 38±n/a nM
Citation Yoshinaga, HMasumoto, SKoyama, KKinomura, NMatsumoto, YKato, TBaba, SMatsumoto, KHorisawa, TOki, HYabuuchi, KKodo, T Discovery of SMP-304, a novel benzylpiperidine derivative with serotonin transporter inhibitory activity and 5-HT Bioorg Med Chem25:293-304 (2017) 
 
Sodium-dependent serotonin transporter
Name:Sodium-dependent serotonin transporter
Type:Multi-pass membrane protein
Mol. Mass.:70322.51
Organism:Homo sapiens (Human)
Description:P31645
Residue:630
BDBM50206797
NameBDBM50206797
Synonyms:CHEMBL3974952
TypeSmall organic molecule
Emp. Form.C22H28BrNO2
Mol. Mass.418.367
SMILESCOc1cccc(CCN2CCC(Cc3cc(OC)ccc3Br)CC2)c1