Reaction Details
Target5-hydroxytryptamine receptor 1A
LigandBDBM50206797
Substrate/Competitorn/a
Meas. Tech.ChEMBL_1629238 (CHEMBL3871864)
Ki 0.820000±n/a nM
Citation Yoshinaga, HMasumoto, SKoyama, KKinomura, NMatsumoto, YKato, TBaba, SMatsumoto, KHorisawa, TOki, HYabuuchi, KKodo, T Discovery of SMP-304, a novel benzylpiperidine derivative with serotonin transporter inhibitory activity and 5-HT Bioorg Med Chem25:293-304 (2017) 
 
5-hydroxytryptamine receptor 1A
Name:5-hydroxytryptamine receptor 1A
Type:n/a
Mol. Mass.:46122.49
Organism:Homo sapiens (Human)
Description:n/a
Residue:422
BDBM50206797
NameBDBM50206797
Synonyms:CHEMBL3974952
TypeSmall organic molecule
Emp. Form.C22H28BrNO2
Mol. Mass.418.367
SMILESCOc1cccc(CCN2CCC(Cc3cc(OC)ccc3Br)CC2)c1