Reaction Details
TargetProcathepsin L
LigandBDBM50410608
Substrate/Competitorn/a
Meas. Tech.ChEMBL_1629337 (CHEMBL3871963)
Ki>5000±n/a nM
Citation Schirmeister, TSchmitz, JJung, SSchmenger, TKrauth-Siegel, RLGütschow, M Evaluation of dipeptide nitriles as inhibitors of rhodesain, a major cysteine protease of Trypanosoma brucei. Bioorg Med Chem Lett27:45-50 (2017) 
 
Procathepsin L
Name:Procathepsin L
Type:Enzyme
Mol. Mass.:37557.19
Organism:Homo sapiens (Human)
Description:Purchased from Calbiochem (San Diego, CA).
Residue:333
BDBM50410608
NameBDBM50410608
Synonyms:CHEMBL200151
TypeSmall organic molecule
Emp. Form.C17H21N3O3
Mol. Mass.315.3669
SMILESO=C(NC1(CCCCC1)C(=O)NCC#N)OCc1ccccc1