Reaction Details
TargetPeroxisome proliferator-activated receptor gamma
LigandBDBM50043280
Substrate/Competitorn/a
Meas. Tech.ChEMBL_1630578 (CHEMBL3873284)
EC50 4700±n/a nM
Citation Kaserer, TObermoser, VWeninger, AGust, RSchuster, D Evaluation of selected 3D virtual screening tools for the prospective identification of peroxisome proliferator-activated receptor (PPAR)¿ partial agonists. Eur J Med Chem124:49-62 (2016) 
 
Peroxisome proliferator-activated receptor gamma
Name:Peroxisome proliferator-activated receptor gamma
Type:Nuclear Receptor
Mol. Mass.:57613.46
Organism:Homo sapiens (Human)
Description:P37231
Residue:505
BDBM50043280
NameBDBM50043280
Synonyms:4'-((1,4'-dimethyl-2'-propyl(2,6'-bi-1H-benzimidazol)-1'-yl)methyl)-(1,1'-biphenyl)-2-carboxylic acid 4'-[(1,4'-dimethyl-2'propyl[2,6'-bi-1H-benzimidazol]-1'-yl)methyl]-[1,1'-biphenyl]-2-carboxylic acid 4'-[(1,7'-dimethyl-2'-propyl-1H,3'H-2,5'-bibenzimidazol-3'-yl)methyl]biphenyl-2-carboxylic acid CHEMBL1017 | TELMISARTAN
TypeSmall organic molecule
Emp. Form.C33H30N4O2
Mol. Mass.514.6169
SMILESCCCc1nc2c(C)cc(cc2n1Cc1ccc(cc1)-c1ccccc1C(O)=O)-c1nc2ccccc2n1C