Reaction Details
TargetCarbonic anhydrase 9
LigandBDBM50207737
Substrate/Competitorn/a
Meas. Tech.ChEMBL_1632259 (CHEMBL3874965)
Ki 11±n/a nM
Citation Ivanova, JBalode, A?alubovskis, RLeitans, JKazaks, AVullo, DTars, KSupuran, CT 5-Substituted-benzylsulfanyl-thiophene-2-sulfonamides with effective carbonic anhydrase inhibitory activity: Solution and crystallographic investigations. Bioorg Med Chem25:857-863 (2017) 
 
Carbonic anhydrase 9
Name:Carbonic anhydrase 9
Type:Enzyme
Mol. Mass.:49669.03
Organism:Homo sapiens (Human)
Description:Catalytic domain of human cloned isozyme was used in the assay
Residue:459
BDBM50207737
NameBDBM50207737
Synonyms:CHEMBL3928543
TypeSmall organic molecule
Emp. Form.C11H10FNO2S3
Mol. Mass.303.396
SMILESNS(=O)(=O)c1ccc(SCc2ccc(F)cc2)s1