Reaction Details
TargetCarbonic anhydrase 9
LigandBDBM50207843
Substrate/Competitorn/a
Meas. Tech.ChEMBL_1632259 (CHEMBL3874965)
Ki 6.1±n/a nM
Citation Ivanova, JBalode, A?alubovskis, RLeitans, JKazaks, AVullo, DTars, KSupuran, CT 5-Substituted-benzylsulfanyl-thiophene-2-sulfonamides with effective carbonic anhydrase inhibitory activity: Solution and crystallographic investigations. Bioorg Med Chem25:857-863 (2017) 
 
Carbonic anhydrase 9
Name:Carbonic anhydrase 9
Type:Enzyme
Mol. Mass.:49669.03
Organism:Homo sapiens (Human)
Description:Catalytic domain of human cloned isozyme was used in the assay
Residue:459
BDBM50207843
NameBDBM50207843
Synonyms:CHEMBL3956141
TypeSmall organic molecule
Emp. Form.C12H13NO3S3
Mol. Mass.315.432
SMILESCOc1ccc(CSc2ccc(s2)S(N)(=O)=O)cc1