Reaction Details
TargetCholinesterase
LigandBDBM50208212
Substrate/Competitorn/a
Meas. Tech.ChEMBL_1632481 (CHEMBL3875273)
IC50 1951±n/a nM
Citation Wieckowska, AKolaczkowski, MBucki, AGodyn, JMarcinkowska, MWieckowski, KZareba, PSiwek, AKazek, GGluch-Lutwin, MMierzejewski, PBienkowski, PSienkiewicz-Jarosz, HKnez, DWichur, TGobec, SMalawska, B Novel multi-target-directed ligands for Alzheimer's disease: Combining cholinesterase inhibitors and 5-HT Eur J Med Chem124:63-81 (2016) 
 
Cholinesterase
Name:Cholinesterase
Type:Enzyme
Mol. Mass.:65643.35
Organism:Equus caballus (Horse)
Description:P81908
Residue:574
BDBM50208212
NameBDBM50208212
Synonyms:CHEMBL3883443
TypeSmall organic molecule
Emp. Form.C28H32N4O2S
Mol. Mass.488.644
SMILESCN(CCN1CCN(CC1)c1cccc2n(ccc12)S(=O)(=O)c1ccccc1)Cc1ccccc1