Reaction Details
Target5-hydroxytryptamine receptor 6
LigandBDBM50208253
Substrate/Competitorn/a
Meas. Tech.ChEMBL_1632480 (CHEMBL3875272)
Ki 10.0±n/a nM
Citation Wieckowska, AKolaczkowski, MBucki, AGodyn, JMarcinkowska, MWieckowski, KZareba, PSiwek, AKazek, GGluch-Lutwin, MMierzejewski, PBienkowski, PSienkiewicz-Jarosz, HKnez, DWichur, TGobec, SMalawska, B Novel multi-target-directed ligands for Alzheimer's disease: Combining cholinesterase inhibitors and 5-HT Eur J Med Chem124:63-81 (2016) 
 
5-hydroxytryptamine receptor 6
Name:5-hydroxytryptamine receptor 6
Type:G Protein-Coupled Receptor (GPCR)
Mol. Mass.:46968.43
Organism:Homo sapiens (Human)
Description:P50406
Residue:440
BDBM50208253
NameBDBM50208253
Synonyms:CHEMBL3884867
TypeSmall organic molecule
Emp. Form.C29H34N4O2S
Mol. Mass.502.671
SMILESCN(CCCN1CCN(CC1)c1cccc2n(ccc12)S(=O)(=O)c1ccccc1)Cc1ccccc1