Reaction Details
TargetCholinesterase
LigandBDBM50208259
Substrate/Competitorn/a
Meas. Tech.ChEMBL_1632481 (CHEMBL3875273)
IC50 1673±n/a nM
Citation Wieckowska, AKolaczkowski, MBucki, AGodyn, JMarcinkowska, MWieckowski, KZareba, PSiwek, AKazek, GGluch-Lutwin, MMierzejewski, PBienkowski, PSienkiewicz-Jarosz, HKnez, DWichur, TGobec, SMalawska, B Novel multi-target-directed ligands for Alzheimer's disease: Combining cholinesterase inhibitors and 5-HT Eur J Med Chem124:63-81 (2016) 
 
Cholinesterase
Name:Cholinesterase
Type:Enzyme
Mol. Mass.:65643.35
Organism:Equus caballus (Horse)
Description:P81908
Residue:574
BDBM50208259
NameBDBM50208259
Synonyms:CHEMBL3884704
TypeSmall organic molecule
Emp. Form.C30H36N4O2S
Mol. Mass.516.697
SMILESO=S(=O)(c1ccccc1)n1ccc2c(cccc12)N1CCN(CCCCCNCc2ccccc2)CC1