Reaction Details
Target5-hydroxytryptamine receptor 6
LigandBDBM50208213
Substrate/Competitorn/a
Meas. Tech.ChEMBL_1632480 (CHEMBL3875272)
Ki 16±n/a nM
Citation Wieckowska, AKolaczkowski, MBucki, AGodyn, JMarcinkowska, MWieckowski, KZareba, PSiwek, AKazek, GGluch-Lutwin, MMierzejewski, PBienkowski, PSienkiewicz-Jarosz, HKnez, DWichur, TGobec, SMalawska, B Novel multi-target-directed ligands for Alzheimer's disease: Combining cholinesterase inhibitors and 5-HT Eur J Med Chem124:63-81 (2016) 
 
5-hydroxytryptamine receptor 6
Name:5-hydroxytryptamine receptor 6
Type:G Protein-Coupled Receptor (GPCR)
Mol. Mass.:46968.43
Organism:Homo sapiens (Human)
Description:P50406
Residue:440
BDBM50208213
NameBDBM50208213
Synonyms:CHEMBL3884254
TypeSmall organic molecule
Emp. Form.C34H44ClN5O2S
Mol. Mass.622.263
SMILESCl.O=S(=O)(c1ccccc1)n1ccc2c(cccc12)N1CCN(CCCCNC2CCN(Cc3ccccc3)CC2)CC1