Reaction Details
TargetAcetylcholinesterase
LigandBDBM50208216
Substrate/Competitorn/a
Meas. Tech.ChEMBL_1632479 (CHEMBL3875271)
IC50 15±n/a nM
Citation Wieckowska, AKolaczkowski, MBucki, AGodyn, JMarcinkowska, MWieckowski, KZareba, PSiwek, AKazek, GGluch-Lutwin, MMierzejewski, PBienkowski, PSienkiewicz-Jarosz, HKnez, DWichur, TGobec, SMalawska, B Novel multi-target-directed ligands for Alzheimer's disease: Combining cholinesterase inhibitors and 5-HT Eur J Med Chem124:63-81 (2016) 
 
Acetylcholinesterase
Name:Acetylcholinesterase
Type:Enzyme
Mol. Mass.:71812.79
Organism:Electrophorus electricus (Electric eel)
Description:n/a
Residue:633
BDBM50208216
NameBDBM50208216
Synonyms:CHEMBL3884690
TypeSmall organic molecule
Emp. Form.C38H45N5O2S
Mol. Mass.635.861
SMILESO=S(=O)(c1ccccc1)n1ccc2c(cccc12)N1CCN(CCCCCCCNc2c3CCCCc3nc3ccccc23)CC1