Reaction Details
TargetWD repeat-containing protein 5
LigandBDBM50208389
Substrate/Competitorn/a
Meas. Tech.ChEMBL_1632710 (CHEMBL3875502)
IC50 30±n/a nM
Citation Li, DDChen, WLWang, ZHXie, YYXu, XLJiang, ZYZhang, XJYou, QDGuo, XK High-affinity small molecular blockers of mixed lineage leukemia 1 (MLL1)-WDR5 interaction inhibit MLL1 complex H3K4 methyltransferase activity. Eur J Med Chem124:480-489 (2016) 
 
WD repeat-containing protein 5
Name:WD repeat-containing protein 5
Type:Protein
Mol. Mass.:36597.13
Organism:Homo sapiens (Human)
Description:P61964
Residue:334
BDBM50208389
NameBDBM50208389
Synonyms:CHEMBL3884527
TypeSmall organic molecule
Emp. Form.C29H34ClFN6O2
Mol. Mass.553.071
SMILESCN1CCN(CC1)c1ccc(cc1NC(=O)c1cc(N)c(F)c(C)c1Cl)-c1ccc(NC(=O)C(C)(C)N)cc1