Reaction Details
TargetD(2) dopamine receptor
LigandBDBM50208446
Substrate/Competitorn/a
Meas. Tech.ChEMBL_1632884 (CHEMBL3875676)
Ki 2.7±n/a nM
Citation Cao, XChen, YZhang, YQiu, YYu, MXu, XLiu, XLiu, BFZhang, G Synthesis and biological evaluation of new 6-hydroxypyridazinone benzisoxazoles: Potential multi-receptor-targeting atypical antipsychotics. Eur J Med Chem124:713-728 (2016) 
 
D(2) dopamine receptor
Name:D(2) dopamine receptor
Type:G Protein-Coupled Receptor (GPCR)
Mol. Mass.:50931.60
Organism:Rattus norvegicus (rat)
Description:P61169
Residue:444
BDBM50208446
NameBDBM50208446
Synonyms:CHEMBL3884161
TypeSmall organic molecule
Emp. Form.C25H23Cl2FN4O3
Mol. Mass.517.38
SMILESFc1ccc2c(noc2c1)C1CCN(CCCOc2ccc(=O)n(n2)-c2cc(Cl)ccc2Cl)CC1