Reaction Details
Target5-hydroxytryptamine receptor 2A
LigandBDBM50208458
Substrate/Competitorn/a
Meas. Tech.ChEMBL_1632886 (CHEMBL3875678)
Ki 3.2±n/a nM
Citation Cao, XChen, YZhang, YQiu, YYu, MXu, XLiu, XLiu, BFZhang, G Synthesis and biological evaluation of new 6-hydroxypyridazinone benzisoxazoles: Potential multi-receptor-targeting atypical antipsychotics. Eur J Med Chem124:713-728 (2016) 
 
5-hydroxytryptamine receptor 2A
Name:5-hydroxytryptamine receptor 2A
Type:G Protein-Coupled Receptor (GPCR)
Mol. Mass.:52852.05
Organism:Rattus norvegicus (rat)
Description:Rat cortex membranes 5-HT2A receptors.
Residue:471
BDBM50208458
NameBDBM50208458
Synonyms:CHEMBL3884034
TypeSmall organic molecule
Emp. Form.C25H23F3N4O3
Mol. Mass.484.4703
SMILESFc1ccc2c(noc2c1)C1CCN(CCCOc2ccc(=O)n(n2)-c2ccc(F)c(F)c2)CC1