Reaction Details
TargetEpidermal growth factor receptor
LigandBDBM50208588
Substrate/Competitorn/a
Meas. Tech.ChEMBL_1633048 (CHEMBL3875840)
IC50>100000±n/a nM
Citation Phuangsawai, OBeswick, PRatanabunyong, STabtimmai, LSuphakun, PObounchoey, PSrisook, PHorata, NChuckowree, IHannongbua, SWard, SEChoowongkomon, KGleeson, MP Evaluation of the anti-malarial activity and cytotoxicity of 2,4-diamino-pyrimidine-based kinase inhibitors. Eur J Med Chem124:896-905 (2016) 
 
Epidermal growth factor receptor
Name:Epidermal growth factor receptor
Type:Receptor Kinase Domain
Mol. Mass.:134279.59
Organism:Homo sapiens (Human)
Description:P00533
Residue:1210
BDBM50208588
NameBDBM50208588
Synonyms:CHEMBL3884240
TypeSmall organic molecule
Emp. Form.C20H22N6O3S
Mol. Mass.426.492
SMILESNS(=O)(=O)c1cccc(Nc2ccnc(Nc3ccc(cc3)N3CCOCC3)n2)c1