Reaction Details
TargetTestis-specific serine/threonine-protein kinase 1
LigandBDBM50208911
Substrate/Competitorn/a
Meas. Tech.ChEMBL_1633296 (CHEMBL3876088)
IC50 3117±n/a nM
Citation Katz, JDHaidle, AChilders, KKZabierek, AAJewell, JPHou, YAltman, MDSzewczak, AChen, DHarsch, AHayashi, MWarren, LHutton, MNuthall, HSu, HPMunshi, SStanton, MGDavies, IWMunoz, BNorthrup, A Structure guided design of a series of selective pyrrolopyrimidinone MARK inhibitors. Bioorg Med Chem Lett27:114-120 (2017) 
 
Testis-specific serine/threonine-protein kinase 1
Name:Testis-specific serine/threonine-protein kinase 1
Type:Enzyme Catalytic Domain
Mol. Mass.:41624.03
Organism:Homo sapiens (Human)
Description:gi_14042947
Residue:367
BDBM50208911
NameBDBM50208911
Synonyms:CHEMBL3884319
TypeSmall organic molecule
Emp. Form.C23H22N4O2
Mol. Mass.386.4464
SMILESCC1(C)C(=O)N([C@H]2CCc3c2cccc3O)c2nc(Nc3ccccc3)ncc12