Reaction Details
TargetMAP/microtubule affinity-regulating kinase 3
LigandBDBM50208922
Substrate/Competitorn/a
Meas. Tech.ChEMBL_1633231 (CHEMBL3876023)
IC50 117±n/a nM
Citation Katz, JDHaidle, AChilders, KKZabierek, AAJewell, JPHou, YAltman, MDSzewczak, AChen, DHarsch, AHayashi, MWarren, LHutton, MNuthall, HSu, HPMunshi, SStanton, MGDavies, IWMunoz, BNorthrup, A Structure guided design of a series of selective pyrrolopyrimidinone MARK inhibitors. Bioorg Med Chem Lett27:114-120 (2017) 
 
MAP/microtubule affinity-regulating kinase 3
Name:MAP/microtubule affinity-regulating kinase 3
Type:Protein
Mol. Mass.:84525.94
Organism:Homo sapiens (Human)
Description:P27448
Residue:753
BDBM50208922
NameBDBM50208922
Synonyms:CHEMBL3884253
TypeSmall organic molecule
Emp. Form.C17H21N5O
Mol. Mass.311.3815
SMILESCC[C@H](C)N1C(=O)C(C)(C)c2cnc(Nc3cccnc3)nc12