Reaction Details
TargetMAP/microtubule affinity-regulating kinase 3
LigandBDBM50208927
Substrate/Competitorn/a
Meas. Tech.ChEMBL_1633231 (CHEMBL3876023)
IC50 10.0±n/a nM
Citation Katz, JDHaidle, AChilders, KKZabierek, AAJewell, JPHou, YAltman, MDSzewczak, AChen, DHarsch, AHayashi, MWarren, LHutton, MNuthall, HSu, HPMunshi, SStanton, MGDavies, IWMunoz, BNorthrup, A Structure guided design of a series of selective pyrrolopyrimidinone MARK inhibitors. Bioorg Med Chem Lett27:114-120 (2017) 
 
MAP/microtubule affinity-regulating kinase 3
Name:MAP/microtubule affinity-regulating kinase 3
Type:Protein
Mol. Mass.:84525.94
Organism:Homo sapiens (Human)
Description:P27448
Residue:753
BDBM50208927
NameBDBM50208927
Synonyms:CHEMBL3884318
TypeSmall organic molecule
Emp. Form.C21H21N5O2
Mol. Mass.375.4237
SMILESC[C@H](N1C(=O)C(C)(C)c2cnc(Nc3cccnc3)nc12)c1cccc(O)c1