Reaction Details
TargetMAP/microtubule affinity-regulating kinase 4
LigandBDBM50208912
Substrate/Competitorn/a
Meas. Tech.ChEMBL_1633232 (CHEMBL3876024)
IC50 5910±n/a nM
Citation Katz, JDHaidle, AChilders, KKZabierek, AAJewell, JPHou, YAltman, MDSzewczak, AChen, DHarsch, AHayashi, MWarren, LHutton, MNuthall, HSu, HPMunshi, SStanton, MGDavies, IWMunoz, BNorthrup, A Structure guided design of a series of selective pyrrolopyrimidinone MARK inhibitors. Bioorg Med Chem Lett27:114-120 (2017) 
 
MAP/microtubule affinity-regulating kinase 4
Name:MAP/microtubule affinity-regulating kinase 4
Type:PROTEIN
Mol. Mass.:82561.08
Organism:Homo sapiens (Human)
Description:ChEMBL_774620
Residue:752
BDBM50208912
NameBDBM50208912
Synonyms:CHEMBL3883766
TypeSmall organic molecule
Emp. Form.C17H21N5O
Mol. Mass.311.3815
SMILESCC[C@@H](C)N1C(=O)C(C)(C)c2cnc(Nc3cccnc3)nc12