Reaction Details
TargetSerine/threonine-protein kinase Nek6
LigandBDBM50208911
Substrate/Competitorn/a
Meas. Tech.ChEMBL_1633323 (CHEMBL3876115)
IC50 10000±n/a nM
Citation Katz, JDHaidle, AChilders, KKZabierek, AAJewell, JPHou, YAltman, MDSzewczak, AChen, DHarsch, AHayashi, MWarren, LHutton, MNuthall, HSu, HPMunshi, SStanton, MGDavies, IWMunoz, BNorthrup, A Structure guided design of a series of selective pyrrolopyrimidinone MARK inhibitors. Bioorg Med Chem Lett27:114-120 (2017) 
 
Serine/threonine-protein kinase Nek6
Name:Serine/threonine-protein kinase Nek6
Type:PROTEIN
Mol. Mass.:35724.53
Organism:Homo sapiens (Human)
Description:ChEMBL_1446777
Residue:313
BDBM50208911
NameBDBM50208911
Synonyms:CHEMBL3884319
TypeSmall organic molecule
Emp. Form.C23H22N4O2
Mol. Mass.386.4464
SMILESCC1(C)C(=O)N([C@H]2CCc3c2cccc3O)c2nc(Nc3ccccc3)ncc12