Reaction Details
TargetMAP/microtubule affinity-regulating kinase 4
LigandBDBM50208926
Substrate/Competitorn/a
Meas. Tech.ChEMBL_1633232 (CHEMBL3876024)
IC50>10000±n/a nM
Citation Katz, JDHaidle, AChilders, KKZabierek, AAJewell, JPHou, YAltman, MDSzewczak, AChen, DHarsch, AHayashi, MWarren, LHutton, MNuthall, HSu, HPMunshi, SStanton, MGDavies, IWMunoz, BNorthrup, A Structure guided design of a series of selective pyrrolopyrimidinone MARK inhibitors. Bioorg Med Chem Lett27:114-120 (2017) 
 
MAP/microtubule affinity-regulating kinase 4
Name:MAP/microtubule affinity-regulating kinase 4
Type:PROTEIN
Mol. Mass.:82561.08
Organism:Homo sapiens (Human)
Description:ChEMBL_774620
Residue:752
BDBM50208926
NameBDBM50208926
Synonyms:CHEMBL3884179
TypeSmall organic molecule
Emp. Form.C21H20FN5O
Mol. Mass.377.4148
SMILESC[C@H](N1C(=O)C(C)(C)c2cnc(Nc3cccnc3)nc12)c1ccc(F)cc1