Reaction Details
TargetMAP/microtubule affinity-regulating kinase 3
LigandBDBM50208934
Substrate/Competitorn/a
Meas. Tech.ChEMBL_1633231 (CHEMBL3876023)
IC50>30000±n/a nM
Citation Katz, JDHaidle, AChilders, KKZabierek, AAJewell, JPHou, YAltman, MDSzewczak, AChen, DHarsch, AHayashi, MWarren, LHutton, MNuthall, HSu, HPMunshi, SStanton, MGDavies, IWMunoz, BNorthrup, A Structure guided design of a series of selective pyrrolopyrimidinone MARK inhibitors. Bioorg Med Chem Lett27:114-120 (2017) 
 
MAP/microtubule affinity-regulating kinase 3
Name:MAP/microtubule affinity-regulating kinase 3
Type:Protein
Mol. Mass.:84525.94
Organism:Homo sapiens (Human)
Description:P27448
Residue:753
BDBM50208934
NameBDBM50208934
Synonyms:CHEMBL3884098
TypeSmall organic molecule
Emp. Form.C20H26N4
Mol. Mass.322.4472
SMILESCC1(C)CN(C2CCCCC2)c2nc(Nc3ccccc3)ncc12