Reaction Details
TargetCarbonic anhydrase 1
LigandBDBM50209285
Substrate/Competitorn/a
Meas. Tech.ChEBML_1633807
Ki 917±n/a nM
Citation Angapelly, SRamya, PVAngeli, AMonti, SMBuonanno, MAlvala, MSupuran, CTArifuddin, M Discovery of 4-sulfamoyl-phenyl-ß-lactams as a new class of potent carbonic anhydrase isoforms I, II, IV and VII inhibitors: The first example of subnanomolar CA IV inhibitors. Bioorg Med Chem25:539-544 (2017) 
 
Carbonic anhydrase 1
Name:Carbonic anhydrase 1
Type:Enzyme
Mol. Mass.:28873.37
Organism:Homo sapiens (Human)
Description:P00915
Residue:261
BDBM50209285
NameBDBM50209285
Synonyms:CHEMBL3884696
TypeSmall organic molecule
Emp. Form.C22H22N2O6S2
Mol. Mass.474.55
SMILESCOc1cc(cc(OC)c1OC)[C@H]1[C@@H](C(=O)N1c1ccc(cc1)S(N)(=O)=O)c1cccs1