Reaction Details
TargetCarbonic anhydrase 4
LigandBDBM50209289
Substrate/Competitorn/a
Meas. Tech.ChEBML_1633809
Ki 44±n/a nM
Citation Angapelly, SRamya, PVAngeli, AMonti, SMBuonanno, MAlvala, MSupuran, CTArifuddin, M Discovery of 4-sulfamoyl-phenyl-ß-lactams as a new class of potent carbonic anhydrase isoforms I, II, IV and VII inhibitors: The first example of subnanomolar CA IV inhibitors. Bioorg Med Chem25:539-544 (2017) 
 
Carbonic anhydrase 4
Name:Carbonic anhydrase 4
Type:Enzyme
Mol. Mass.:35037.98
Organism:Homo sapiens (Human)
Description:P22748
Residue:312
BDBM50209289
NameBDBM50209289
Synonyms:CHEMBL3885091
TypeSmall organic molecule
Emp. Form.C22H18F2N2O4S
Mol. Mass.444.451
SMILESNS(=O)(=O)c1ccc(cc1)N1[C@H]([C@@H](C1=O)c1ccccc1)c1ccccc1OC(F)F