Reaction Details
TargetCarbonic anhydrase 2
LigandBDBM50209289
Substrate/Competitorn/a
Meas. Tech.ChEBML_1633808
Ki 3.8±n/a nM
Citation Angapelly, SRamya, PVAngeli, AMonti, SMBuonanno, MAlvala, MSupuran, CTArifuddin, M Discovery of 4-sulfamoyl-phenyl-ß-lactams as a new class of potent carbonic anhydrase isoforms I, II, IV and VII inhibitors: The first example of subnanomolar CA IV inhibitors. Bioorg Med Chem25:539-544 (2017) 
 
Carbonic anhydrase 2
Name:Carbonic anhydrase 2
Type:Enzyme
Mol. Mass.:29250.71
Organism:Homo sapiens (Human)
Description:P00918
Residue:260
BDBM50209289
NameBDBM50209289
Synonyms:CHEMBL3885091
TypeSmall organic molecule
Emp. Form.C22H18F2N2O4S
Mol. Mass.444.451
SMILESNS(=O)(=O)c1ccc(cc1)N1[C@H]([C@@H](C1=O)c1ccccc1)c1ccccc1OC(F)F