Reaction Details
TargetCarbonic anhydrase 1
LigandBDBM50209293
Substrate/Competitorn/a
Meas. Tech.ChEMBL_1633807 (CHEMBL3876599)
Ki 7.3±n/a nM
Citation Angapelly, SRamya, PVAngeli, AMonti, SMBuonanno, MAlvala, MSupuran, CTArifuddin, M Discovery of 4-sulfamoyl-phenyl-ß-lactams as a new class of potent carbonic anhydrase isoforms I, II, IV and VII inhibitors: The first example of subnanomolar CA IV inhibitors. Bioorg Med Chem25:539-544 (2017) 
 
Carbonic anhydrase 1
Name:Carbonic anhydrase 1
Type:Enzyme
Mol. Mass.:28873.37
Organism:Homo sapiens (Human)
Description:P00915
Residue:261
BDBM50209293
NameBDBM50209293
Synonyms:CHEMBL3884597
TypeSmall organic molecule
Emp. Form.C23H22N2O5S
Mol. Mass.438.496
SMILESCOc1ccc(cc1OC)[C@H]1[C@@H](C(=O)N1c1ccc(cc1)S(N)(=O)=O)c1ccccc1