Reaction Details
TargetCarbonic anhydrase 2
LigandBDBM50209225
Substrate/Competitorn/a
Meas. Tech.ChEMBL_1633808 (CHEMBL3876600)
Ki 3.4±n/a nM
Citation Angapelly, SRamya, PVAngeli, AMonti, SMBuonanno, MAlvala, MSupuran, CTArifuddin, M Discovery of 4-sulfamoyl-phenyl-ß-lactams as a new class of potent carbonic anhydrase isoforms I, II, IV and VII inhibitors: The first example of subnanomolar CA IV inhibitors. Bioorg Med Chem25:539-544 (2017) 
 
Carbonic anhydrase 2
Name:Carbonic anhydrase 2
Type:Enzyme
Mol. Mass.:29250.71
Organism:Homo sapiens (Human)
Description:P00918
Residue:260
BDBM50209225
NameBDBM50209225
Synonyms:CHEMBL3883807
TypeSmall organic molecule
Emp. Form.C22H22N2O6S2
Mol. Mass.474.55
SMILESCOc1cc(OC)c([C@H]2[C@@H](C(=O)N2c2ccc(cc2)S(N)(=O)=O)c2cccs2)c(OC)c1