Reaction Details
TargetAmine oxidase [flavin-containing] A
LigandBDBM29136
Substrate/Competitorn/a
Meas. Tech.ChEMBL_1633968 (CHEMBL3876760)
IC50 2560±n/a nM
Citation Xiao, GLi, YQiang, XXu, RZheng, YCao, ZLuo, LYang, XSang, ZSu, FDeng, Y Design, synthesis and biological evaluation of 4'-aminochalcone-rivastigmine hybrids as multifunctional agents for the treatment of Alzheimer's disease. Bioorg Med Chem25:1030-1041 (2017) 
 
Amine oxidase [flavin-containing] A
Name:Amine oxidase [flavin-containing] A
Type:Protein
Mol. Mass.:59689.53
Organism:Homo sapiens (Human)
Description:P21397
Residue:527
BDBM29136
NameBDBM29136
Synonyms:CHEMBL92401 Iprazid | Iproniazid
TypeSmall organic molecule
Emp. Form.C9H13N3O
Mol. Mass.179.219
SMILESCC(C)NNC(=O)c1ccncc1