Reaction Details
TargetPyruvate kinase
LigandBDBM50210456
Substrate/Competitorn/a
Meas. Tech.ChEMBL_1634707 (CHEMBL3877605)
IC50 132±n/a nM
Citation Labrière, CGong, HFinlay, BBReiner, NEYoung, RN Further investigation of inhibitors of MRSA pyruvate kinase: Towards the conception of novel antimicrobial agents. Eur J Med Chem125:1-13 (2017) 
 
Pyruvate kinase
Name:Pyruvate kinase
Type:PROTEIN
Mol. Mass.:63128.44
Organism:Staphylococcus aureus (strain MRSA252)
Description:ChEMBL_1434805
Residue:585
BDBM50210456
NameBDBM50210456
Synonyms:CHEMBL3945342
TypeSmall organic molecule
Emp. Form.C17H11Br2NO2
Mol. Mass.421.083
SMILESOc1cc(Br)ccc1C(=O)\C=C\c1cc2ccc(Br)cc2[nH]1