Reaction Details
TargetPyruvate kinase
LigandBDBM50210439
Substrate/Competitorn/a
Meas. Tech.ChEMBL_1634707 (CHEMBL3877605)
IC50 23±n/a nM
Citation Labrière, CGong, HFinlay, BBReiner, NEYoung, RN Further investigation of inhibitors of MRSA pyruvate kinase: Towards the conception of novel antimicrobial agents. Eur J Med Chem125:1-13 (2017) 
 
Pyruvate kinase
Name:Pyruvate kinase
Type:PROTEIN
Mol. Mass.:63128.44
Organism:Staphylococcus aureus (strain MRSA252)
Description:ChEMBL_1434805
Residue:585
BDBM50210439
NameBDBM50210439
Synonyms:CHEMBL3907484
TypeSmall organic molecule
Emp. Form.C16H9Br2N3OS
Mol. Mass.451.135
SMILESBrc1ccc2[nH]c(cc2c1)C(=O)Nc1nc2ccc(Br)cc2s1