Reaction Details
TargetD(2) dopamine receptor
LigandBDBM50210759
Substrate/Competitorn/a
Meas. Tech.ChEMBL_1634986 (CHEMBL3877884)
Ki 107±n/a nM
Citation Madapa, SGadhiya, SKurtzman, TAlberts, ILRamsey, SReith, MHarding, WW Synthesis and evaluation of C9 alkoxy analogues of (-)-stepholidine as dopamine receptor ligands. Eur J Med Chem125:255-268 (2017) 
 
D(2) dopamine receptor
Name:D(2) dopamine receptor
Type:Cell-surface receptors
Mol. Mass.:50647.10
Organism:Homo sapiens (Human)
Description:P14416
Residue:443
BDBM50210759
NameBDBM50210759
Synonyms:CHEMBL3905947
TypeSmall organic molecule
Emp. Form.C22H26BrNO4
Mol. Mass.448.35
SMILES[H][C@@]12Cc3c(Br)cc(O)c(OCCCC)c3CN1CCc1cc(OC)c(O)cc21