Reaction Details
TargetD(1A) dopamine receptor
LigandBDBM50210757
Substrate/Competitorn/a
Meas. Tech.ChEMBL_1634985 (CHEMBL3877883)
Ki 1.3±n/a nM
Citation Madapa, SGadhiya, SKurtzman, TAlberts, ILRamsey, SReith, MHarding, WW Synthesis and evaluation of C9 alkoxy analogues of (-)-stepholidine as dopamine receptor ligands. Eur J Med Chem125:255-268 (2017) 
 
D(1A) dopamine receptor
Name:D(1A) dopamine receptor
Type:Enzyme
Mol. Mass.:49303.43
Organism:Homo sapiens (Human)
Description:P21728
Residue:446
BDBM50210757
NameBDBM50210757
Synonyms:CHEMBL3921278
TypeSmall organic molecule
Emp. Form.C20H22BrNO4
Mol. Mass.420.297
SMILES[H][C@@]12Cc3c(Br)cc(O)c(OCC)c3CN1CCc1cc(OC)c(O)cc21