Reaction Details
TargetAlpha-1D adrenergic receptor
LigandBDBM50210789
Substrate/Competitorn/a
Meas. Tech.ChEMBL_1635130 (CHEMBL3878028)
Ki 35±n/a nM
Citation Franchini, SManasieva, LISorbi, CBattisti, UMFossa, PCichero, EDenora, NIacobazzi, RMCilia, APirona, LRonsisvalle, SAricò, GBrasili, L Synthesis, biological evaluation and molecular modeling of 1-oxa-4-thiaspiro- and 1,4-dithiaspiro[4.5]decane derivatives as potent and selective 5-HT Eur J Med Chem125:435-452 (2017) 
 
Alpha-1D adrenergic receptor
Name:Alpha-1D adrenergic receptor
Type:Enzyme Catalytic Domain
Mol. Mass.:60485.82
Organism:Homo sapiens (Human)
Description:adrenergic Alpha1D ADRA1D HUMAN::P25100
Residue:572
BDBM50210789
NameBDBM50210789
Synonyms:CHEMBL3938383
TypeSmall organic molecule
Emp. Form.C18H27NO2S2
Mol. Mass.353.542
SMILESCOc1ccccc1OCCNCC1CSC2(CCCCC2)S1