Reaction Details
Target5-hydroxytryptamine receptor 1A
LigandBDBM50210794
Substrate/Competitorn/a
Meas. Tech.ChEMBL_1635131 (CHEMBL3878029)
Ki 5.0±n/a nM
Citation Franchini, SManasieva, LISorbi, CBattisti, UMFossa, PCichero, EDenora, NIacobazzi, RMCilia, APirona, LRonsisvalle, SAricò, GBrasili, L Synthesis, biological evaluation and molecular modeling of 1-oxa-4-thiaspiro- and 1,4-dithiaspiro[4.5]decane derivatives as potent and selective 5-HT Eur J Med Chem125:435-452 (2017) 
 
5-hydroxytryptamine receptor 1A
Name:5-hydroxytryptamine receptor 1A
Type:n/a
Mol. Mass.:46122.49
Organism:Homo sapiens (Human)
Description:n/a
Residue:422
BDBM50210794
NameBDBM50210794
Synonyms:CHEMBL3892434
TypeSmall organic molecule
Emp. Form.C20H30N2O2S
Mol. Mass.362.529
SMILESCOc1ccccc1N1CCN(CC2CSC3(CCCCC3)O2)CC1