Reaction Details
Target5-hydroxytryptamine receptor 1A
LigandBDBM50210789
Substrate/Competitorn/a
Meas. Tech.ChEMBL_1635131 (CHEMBL3878029)
Ki 0.933254±n/a nM
Citation Franchini, SManasieva, LISorbi, CBattisti, UMFossa, PCichero, EDenora, NIacobazzi, RMCilia, APirona, LRonsisvalle, SAricò, GBrasili, L Synthesis, biological evaluation and molecular modeling of 1-oxa-4-thiaspiro- and 1,4-dithiaspiro[4.5]decane derivatives as potent and selective 5-HT Eur J Med Chem125:435-452 (2017) 
 
5-hydroxytryptamine receptor 1A
Name:5-hydroxytryptamine receptor 1A
Type:n/a
Mol. Mass.:46122.49
Organism:Homo sapiens (Human)
Description:n/a
Residue:422
BDBM50210789
NameBDBM50210789
Synonyms:CHEMBL3938383
TypeSmall organic molecule
Emp. Form.C18H27NO2S2
Mol. Mass.353.542
SMILESCOc1ccccc1OCCNCC1CSC2(CCCCC2)S1