Reaction Details
TargetDiacylglycerol lipase-alpha
LigandBDBM50211269
Substrate/Competitorn/a
Meas. Tech.ChEBML_1636270
IC50 1.000000±n/a nM
Citation Deng, HKooijman, Svan den Nieuwendijk, AMOgasawara, Dvan der Wel, Tvan Dalen, FBaggelaar, MPJanssen, FJvan den Berg, RJden Dulk, HCravatt, BFOverkleeft, HSRensen, PCvan der Stelt, M Triazole Ureas Act as Diacylglycerol Lipase Inhibitors and Prevent Fasting-Induced Refeeding. J Med Chem60:428-440 (2017) 
 
Diacylglycerol lipase-alpha
Name:Diacylglycerol lipase-alpha
Type:PROTEIN
Mol. Mass.:114947.74
Organism:Homo sapiens (Human)
Description:ChEMBL_1449471
Residue:1042
BDBM50211269
NameBDBM50211269
Synonyms:CHEMBL3970032
TypeSmall organic molecule
Emp. Form.C28H26F2N4O2
Mol. Mass.488.5284
SMILESOC(c1cnn(n1)C(=O)N1CCCCC1Cc1ccccc1)(c1ccc(F)cc1)c1ccc(F)cc1