Reaction Details
TargetMonoacylglycerol lipase ABHD6
LigandBDBM50211260
Substrate/Competitorn/a
Meas. Tech.ChEBML_1636269
IC50 20±n/a nM
Citation Deng, HKooijman, Svan den Nieuwendijk, AMOgasawara, Dvan der Wel, Tvan Dalen, FBaggelaar, MPJanssen, FJvan den Berg, RJden Dulk, HCravatt, BFOverkleeft, HSRensen, PCvan der Stelt, M Triazole Ureas Act as Diacylglycerol Lipase Inhibitors and Prevent Fasting-Induced Refeeding. J Med Chem60:428-440 (2017) 
 
Monoacylglycerol lipase ABHD6
Name:Monoacylglycerol lipase ABHD6
Type:PROTEIN
Mol. Mass.:38341.83
Organism:Homo sapiens (Human)
Description:ChEMBL_105457
Residue:337
BDBM50211260
NameBDBM50211260
Synonyms:CHEMBL3964338
TypeSmall organic molecule
Emp. Form.C28H28N4O2
Mol. Mass.452.5475
SMILESOC(c1cnn(n1)C(=O)N1CCCCC1Cc1ccccc1)(c1ccccc1)c1ccccc1