Reaction Details
TargetDiacylglycerol lipase-alpha
LigandBDBM50211262
Substrate/Competitorn/a
Meas. Tech.ChEBML_1636271
IC50 79±n/a nM
Citation Deng, HKooijman, Svan den Nieuwendijk, AMOgasawara, Dvan der Wel, Tvan Dalen, FBaggelaar, MPJanssen, FJvan den Berg, RJden Dulk, HCravatt, BFOverkleeft, HSRensen, PCvan der Stelt, M Triazole Ureas Act as Diacylglycerol Lipase Inhibitors and Prevent Fasting-Induced Refeeding. J Med Chem60:428-440 (2017) 
 
Diacylglycerol lipase-alpha
Name:Diacylglycerol lipase-alpha
Type:PROTEIN
Mol. Mass.:115371.22
Organism:Mus musculus
Description:ChEMBL_101098
Residue:1044
BDBM50211262
NameBDBM50211262
Synonyms:CHEMBL3922787
TypeSmall organic molecule
Emp. Form.C29H28F2N4O3
Mol. Mass.518.5544
SMILESCO[C@H]1CC[C@H](Cc2ccccc2)N(C1)C(=O)n1ncc(n1)C(O)(c1ccc(F)cc1)c1ccc(F)cc1