Reaction Details
TargetAlpha-1A/Alpha-1B/Alpha-1D adrenergic receptor
LigandBDBM34572
Substrate/Competitorn/a
Meas. Tech.ChEMBL_33250 (CHEMBL643530)
Ki 1900±n/a nM
Citation  Analogs of UK 14,304: Structural features responsible for ?A2 adrenoceptor activity Bioorg Med Chem Lett5:1745-1750 (1995)  
 
Alpha-1A/Alpha-1B/Alpha-1D adrenergic receptor
Name:Alpha-1A/Alpha-1B/Alpha-1D adrenergic receptor
Synonyms:Adrenergic receptor alpha-1
Type:n/a
Mol. Mass.:n/a
Description:ASSAY_ID of ChEMBL is 306566
Components:This complex has 3 components.
Component 1
Name:Alpha-1D adrenergic receptor
Type:Enzyme Catalytic Domain
Mol. Mass.:60485.82
Organism:Homo sapiens (Human)
Description:adrenergic Alpha1D ADRA1D HUMAN::P25100
Residue:572
Component 2
Name:Alpha-1B adrenergic receptor
Synonyms:ADA1B_HUMAN Adrenergic alpha1B Adrenergic receptor alpha Alpha 1B-adrenoreceptor | Alpha-1B adrenergic receptor
Type:Enzyme
Mol. Mass.:56862.13
Organism:Homo sapiens (Human)
Description:P35368
Residue:520
Component 3
Name:Alpha-1A adrenergic receptor
Synonyms:ADA1A_HUMAN ADRA1C Alpha 1A-adrenoceptor Alpha adrenergic receptor 1a Alpha-adrenergic receptor 1c adrenergic Alpha1 | adrenergic Alpha1C
Type:Cell-surface receptors
Mol. Mass.:51511.67
Organism:Homo sapiens (Human)
Description:P35348
Residue:466
BDBM34572
NameBDBM34572
Synonyms:BRIMONIDINE MLS000069370 UK 14,304 | cid_2435
TypeSmall organic molecule
Emp. Form.C11H10BrN5
Mol. Mass.292.135
SMILESBrc1c(NC2=NCCN2)ccc2nccnc12