Reaction Details
TargetLanosterol 14-alpha demethylase
LigandBDBM25817
Substrate/Competitorn/a
Meas. Tech.ChEMBL_151525 (CHEMBL760336)
IC50 137±n/a nM
Citation Tsukuda, TShiratori, YWatanabe, MOntsuka, HHattori, KShirai, MShimma, N Modeling, synthesis and biological activity of novel antifungal agents (1). Bioorg Med Chem Lett8:1819-24 (1998) Lanosterol 14-alpha demethylase
Name:Lanosterol 14-alpha demethylase
Type:Protein
Mol. Mass.:56817.21
Organism:Homo sapiens (Human)
Description:Q16850
Residue:509
BDBM25817
NameBDBM25817
Synonyms:2-(2,4-difluorophenyl)-1,3-bis(1H-1,2,4-triazol-1-yl)propan-2-ol Diflucan Fluconazole (f) Triflucan US11247981, Example Fluconazole US9144538, Fluconazole US9556143, Fluconazole | cid_3365
TypeSmall organic molecule
Emp. Form.C13H12F2N6O
Mol. Mass.306.2708
SMILESOC(Cn1cncn1)(Cn1cncn1)c1ccc(F)cc1F