Reaction Details
TargetLanosterol 14-alpha demethylase
LigandBDBM50215880
Substrate/Competitorn/a
Meas. Tech.ChEMBL_151527 (CHEMBL762240)
IC50 22.5±n/a nM
Citation Tsukuda, TShiratori, YWatanabe, MOntsuka, HHattori, KShirai, MShimma, N Modeling, synthesis and biological activity of novel antifungal agents (1). Bioorg Med Chem Lett8:1819-24 (1998) Lanosterol 14-alpha demethylase
Name:Lanosterol 14-alpha demethylase
Type:Protein
Mol. Mass.:56817.21
Organism:Homo sapiens (Human)
Description:Q16850
Residue:509
BDBM50215880
NameBDBM50215880
Synonyms:CHEMBL52311 | Ro-092364
TypeSmall organic molecule
Emp. Form.C21H28F3N3O4
Mol. Mass.443.4599
SMILESCC1(C)CC[C@@H](COc2ccc(OC(F)(F)F)cc2)[C@H](Cn2cncn2)C1OCCO