Reaction Details
TargetLanosterol 14-alpha demethylase
LigandBDBM50215881
Substrate/Competitorn/a
Meas. Tech.ChEMBL_151527 (CHEMBL762240)
IC50 130±n/a nM
Citation Tsukuda, TShiratori, YWatanabe, MOntsuka, HHattori, KShirai, MShimma, N Modeling, synthesis and biological activity of novel antifungal agents (1). Bioorg Med Chem Lett8:1819-24 (1998) Lanosterol 14-alpha demethylase
Name:Lanosterol 14-alpha demethylase
Type:Protein
Mol. Mass.:56817.21
Organism:Homo sapiens (Human)
Description:Q16850
Residue:509
BDBM50215881
NameBDBM50215881
Synonyms:CHEMBL415955 | Ro-092385
TypeSmall organic molecule
Emp. Form.C19H23F3N4O3
Mol. Mass.412.4061
SMILESCC1(C)CC[C@@H](COc2ccc(OC(F)(F)F)cc2)[C@H](Cn2cncn2)\C1=N/O