Reaction Details
TargetD(3) dopamine receptor
LigandBDBM50216340
Substrate/Competitorn/a
Meas. Tech.ChEMBL_62588 (CHEMBL673116)
Ki 5.0±n/a nM
Citation Avenell, KYBoyfield, IColdwell, MCHadley, MSHealy, MAJeffrey, PMJohnson, CNNash, DJRiley, GJScott, EESmith, SAStacey, RStemp, GThewlis, KM Fused aminotetralins: novel antagonists with high selectivity for the dopamine D3 receptor. Bioorg Med Chem Lett8:2859-64 (1998) D(3) dopamine receptor
Name:D(3) dopamine receptor
Type:n/a
Mol. Mass.:44243.43
Organism:Homo sapiens (Human)
Description:n/a
Residue:400
BDBM50216340
NameBDBM50216340
Synonyms:CHEMBL99876
TypeSmall organic molecule
Emp. Form.C30H34N2O4S
Mol. Mass.518.667
SMILES[H][C@]12CCc3c(OS(C)(=O)=O)cccc3[C@]1([H])CCN2CCCCNC(=O)c1ccc(cc1)-c1ccccc1