Reaction Details
TargetD(2) dopamine receptor
LigandBDBM50216348
Substrate/Competitorn/a
Meas. Tech.ChEMBL_60532 (CHEMBL674943)
Ki 501±n/a nM
Citation Avenell, KYBoyfield, IColdwell, MCHadley, MSHealy, MAJeffrey, PMJohnson, CNNash, DJRiley, GJScott, EESmith, SAStacey, RStemp, GThewlis, KM Fused aminotetralins: novel antagonists with high selectivity for the dopamine D3 receptor. Bioorg Med Chem Lett8:2859-64 (1998) D(2) dopamine receptor
Name:D(2) dopamine receptor
Type:Cell-surface receptors
Mol. Mass.:50647.10
Organism:Homo sapiens (Human)
Description:P14416
Residue:443
BDBM50216348
NameBDBM50216348
Synonyms:CHEMBL95759
TypeSmall organic molecule
Emp. Form.C30H34N2O2
Mol. Mass.454.6032
SMILES[H][C@]12CCc3cc(O)ccc3[C@]1([H])CCCN2CCCCNC(=O)c1ccc(cc1)-c1ccccc1