Reaction Details
TargetHistamine H3 receptor
LigandBDBM50215536
Substrate/Competitorn/a
Meas. Tech.ChEMBL_83628 (CHEMBL858407)
Ki 0.151356±n/a nM
Citation Tozer, MJHarper, EAKalindjian, SBPether, MJShankley, NPWatt, GF From histamine to imidazolylalkyl-sulfonamides: the design of a novel series of histamine H3-receptor antagonists. Bioorg Med Chem Lett9:1825-30 (1999) Histamine H3 receptor
Name:Histamine H3 receptor
Type:Enzyme Catalytic Domain
Mol. Mass.:48753.61
Organism:GUINEA PIG
Description:HISTAMINE H3 HRH3 GUINEA PIG::Q9JI35
Residue:445
BDBM50215536
NameBDBM50215536
Synonyms:(R)-Alpha-Methylhistamine CHEMBL268229
TypeSmall organic molecule
Emp. Form.C6H11N3
Mol. Mass.125.1716
SMILESC[C@@H](N)Cc1c[nH]cn1