Reaction Details
Target5-hydroxytryptamine receptor 1D
LigandBDBM50217181
Substrate/Competitorn/a
Meas. Tech.ChEMBL_1978 (CHEMBL617583)
Ki 316±n/a nM
Citation Chan, WNEvans, JMHadley, MSHerdon, HJJerman, JCParsons, AARead, SJStean, TOThompson, MUpton, N Identification of (-)-cis-6-acetyl-4S-(3-chloro-4-fluoro-benzoylamino)- 3,4-dihydro-2,2-dimethyl-2H-benzo[b]pyran-3S-ol as a potential antimigraine agent. Bioorg Med Chem Lett9:285-90 (1999) 5-hydroxytryptamine receptor 1D
Name:5-hydroxytryptamine receptor 1D
Type:Enzyme Catalytic Domain
Mol. Mass.:41551.75
Organism:RAT
Description:5-HT1D HTR1D RAT::P28565
Residue:374
BDBM50217181
NameBDBM50217181
Synonyms:CHEMBL99584
TypeSmall organic molecule
Emp. Form.C19H20N2O4
Mol. Mass.340.3731
SMILESCC(=O)c1ccc2OC(C)(C)[C@H](O)[C@@H](NC(=O)c3cccnc3)c2c1